{"text_format":"1","workbook":"xlsx","n_sheets":2,"sheets":["BHS","Master Data"],"not_rendered":{"charts":0,"images":0,"macros":1,"external_links":0,"defined_names":11,"comments":1,"pivot_tables":0},"unopened":[],"bounds":{"document_bytes":16777216,"sheet_cells":100000,"rows_first":2000,"rows_last":500,"rows_between":2000,"halvings":0,"cell_chars":16384,"cell_head_chars":4096},"cells_cut":0,"cells_raw":0,"read":"whole","date_system":"1900"}

{"sheet":"BHS","index":0,"n_rows":104,"n_cols":15,"rows_kept":104,"cut":false,"hidden":false,"merged":[[1,0,1,14],[0,0,0,14]]}
["Data Peserta Asuransi Kesehatan - SmartCare Executive "]
["PT. ABC"]
[]
["No","Nama Peserta\n(Max. 25 Karakter)","Jenis Kelamin\n(F/M)","Status Peserta\n(E / S / C)","Tanggal Lahir\n(ex: 6-Oct-19)","Kelas Manfaat","Rawat Inap","Rawat Jalan","Gigi","Persalinan","Optic Plan","Nomor Rekening","Nama Bank","Nama Pemegang Rekening","Political Exposed Persons (PEP)"]
[1,"KELUARGA 1 - PESERTA 1","F","E","1980-06-06","028-IP750-OP150-M16000",{"$f":"IF(ISNA(VLOOKUP($F5,'Master Data'!$G$2:$L$41,2,FALSE)),\"\",VLOOKUP($F5,'Master Data'!$G$2:$L$41,2,FALSE))","v":"IP750"},{"$f":"IF(ISNA(VLOOKUP($F5,'Master Data'!$G$2:$L$41,3,FALSE)),\"\",VLOOKUP($F5,'Master Data'!$G$2:$L$41,3,FALSE))","v":"OP150"},{"$f":"IF(ISNA(VLOOKUP($F5,'Master Data'!$G$2:$L$41,4,FALSE)),\"\",VLOOKUP($F5,'Master Data'!$G$2:$L$41,4,FALSE))","v":"-"},{"$f":"IF(ISNA(VLOOKUP($F5,'Master Data'!$G$2:$L$41,5,FALSE)),\"\",VLOOKUP($F5,'Master Data'!$G$2:$L$41,5,FALSE))","v":"M16000"},{"$f":"IF(ISNA(VLOOKUP($F5,'Master Data'!$G$2:$L$41,6,FALSE)),\"\",VLOOKUP($F5,'Master Data'!$G$2:$L$41,6,FALSE))","v":"-"},"0700222987012","BANK MANDIRI","KELUARGA 1 - PESERTA 1"]
[2,"KELUARGA 2 - PESERTA 1","F","E","1980-06-07","033-IP750-D6000-M16000",{"$f":"IF(ISNA(VLOOKUP($F6,'Master Data'!$G$2:$L$41,2,FALSE)),\"\",VLOOKUP($F6,'Master Data'!$G$2:$L$41,2,FALSE))","v":"IP750"},{"$f":"IF(ISNA(VLOOKUP($F6,'Master Data'!$G$2:$L$41,3,FALSE)),\"\",VLOOKUP($F6,'Master Data'!$G$2:$L$41,3,FALSE))","v":"-"},{"$f":"IF(ISNA(VLOOKUP($F6,'Master Data'!$G$2:$L$41,4,FALSE)),\"\",VLOOKUP($F6,'Master Data'!$G$2:$L$41,4,FALSE))","v":"D6000"},{"$f":"IF(ISNA(VLOOKUP($F6,'Master Data'!$G$2:$L$41,5,FALSE)),\"\",VLOOKUP($F6,'Master Data'!$G$2:$L$41,5,FALSE))","v":"M16000"},{"$f":"IF(ISNA(VLOOKUP($F6,'Master Data'!$G$2:$L$41,6,FALSE)),\"\",VLOOKUP($F6,'Master Data'!$G$2:$L$41,6,FALSE))","v":"-"},"0600888555647","BANK MANDIRI","KELUARGA 2 - PESERTA 1"]
[3,"KELUARGA 3 - PESERTA 1","M","E","1980-06-08","004-IP1000",{"$f":"IF(ISNA(VLOOKUP($F7,'Master Data'!$G$2:$L$41,2,FALSE)),\"\",VLOOKUP($F7,'Master Data'!$G$2:$L$41,2,FALSE))","v":"IP1000"},{"$f":"IF(ISNA(VLOOKUP($F7,'Master Data'!$G$2:$L$41,3,FALSE)),\"\",VLOOKUP($F7,'Master Data'!$G$2:$L$41,3,FALSE))","v":"-"},{"$f":"IF(ISNA(VLOOKUP($F7,'Master Data'!$G$2:$L$41,4,FALSE)),\"\",VLOOKUP($F7,'Master Data'!$G$2:$L$41,4,FALSE))","v":"-"},{"$f":"IF(ISNA(VLOOKUP($F7,'Master Data'!$G$2:$L$41,5,FALSE)),\"\",VLOOKUP($F7,'Master Data'!$G$2:$L$41,5,FALSE))","v":"-"},{"$f":"IF(ISNA(VLOOKUP($F7,'Master Data'!$G$2:$L$41,6,FALSE)),\"\",VLOOKUP($F7,'Master Data'!$G$2:$L$41,6,FALSE))","v":"-"},"0700765888112","BANK CENTRAL ASIA","KELUARGA 3 - PESERTA 1"]
[4,"KELUARGA 3 - PESERTA 2","F","S","1980-06-09","023-IP750-M16000",{"$f":"IF(ISNA(VLOOKUP($F8,'Master Data'!$G$2:$L$41,2,FALSE)),\"\",VLOOKUP($F8,'Master Data'!$G$2:$L$41,2,FALSE))","v":"IP750"},{"$f":"IF(ISNA(VLOOKUP($F8,'Master Data'!$G$2:$L$41,3,FALSE)),\"\",VLOOKUP($F8,'Master Data'!$G$2:$L$41,3,FALSE))","v":"-"},{"$f":"IF(ISNA(VLOOKUP($F8,'Master Data'!$G$2:$L$41,4,FALSE)),\"\",VLOOKUP($F8,'Master Data'!$G$2:$L$41,4,FALSE))","v":"-"},{"$f":"IF(ISNA(VLOOKUP($F8,'Master Data'!$G$2:$L$41,5,FALSE)),\"\",VLOOKUP($F8,'Master Data'!$G$2:$L$41,5,FALSE))","v":"M16000"},{"$f":"IF(ISNA(VLOOKUP($F8,'Master Data'!$G$2:$L$41,6,FALSE)),\"\",VLOOKUP($F8,'Master Data'!$G$2:$L$41,6,FALSE))","v":"-"},"0700765888112","BANK CENTRAL ASIA","KELUARGA 3 - PESERTA 1"]
[5,"KELUARGA 3 - PESERTA 3","M","C","1999-06-10","003-IP750",{"$f":"IF(ISNA(VLOOKUP($F9,'Master Data'!$G$2:$L$41,2,FALSE)),\"\",VLOOKUP($F9,'Master Data'!$G$2:$L$41,2,FALSE))","v":"IP750"},{"$f":"IF(ISNA(VLOOKUP($F9,'Master Data'!$G$2:$L$41,3,FALSE)),\"\",VLOOKUP($F9,'Master Data'!$G$2:$L$41,3,FALSE))","v":"-"},{"$f":"IF(ISNA(VLOOKUP($F9,'Master Data'!$G$2:$L$41,4,FALSE)),\"\",VLOOKUP($F9,'Master Data'!$G$2:$L$41,4,FALSE))","v":"-"},{"$f":"IF(ISNA(VLOOKUP($F9,'Master Data'!$G$2:$L$41,5,FALSE)),\"\",VLOOKUP($F9,'Master Data'!$G$2:$L$41,5,FALSE))","v":"-"},{"$f":"IF(ISNA(VLOOKUP($F9,'Master Data'!$G$2:$L$41,6,FALSE)),\"\",VLOOKUP($F9,'Master Data'!$G$2:$L$41,6,FALSE))","v":"-"},"0700765888112","BANK CENTRAL ASIA","KELUARGA 3 - PESERTA 1"]
[6,"KELUARGA 4 - PESERTA 1","F","E","2000-06-11","038-IP750-OP150-D6000-M16000",{"$f":"IF(ISNA(VLOOKUP($F10,'Master Data'!$G$2:$L$41,2,FALSE)),\"\",VLOOKUP($F10,'Master Data'!$G$2:$L$41,2,FALSE))","v":"IP750"},{"$f":"IF(ISNA(VLOOKUP($F10,'Master Data'!$G$2:$L$41,3,FALSE)),\"\",VLOOKUP($F10,'Master Data'!$G$2:$L$41,3,FALSE))","v":"OP150"},{"$f":"IF(ISNA(VLOOKUP($F10,'Master Data'!$G$2:$L$41,4,FALSE)),\"\",VLOOKUP($F10,'Master Data'!$G$2:$L$41,4,FALSE))","v":"D6000"},{"$f":"IF(ISNA(VLOOKUP($F10,'Master Data'!$G$2:$L$41,5,FALSE)),\"\",VLOOKUP($F10,'Master Data'!$G$2:$L$41,5,FALSE))","v":"M16000"},{"$f":"IF(ISNA(VLOOKUP($F10,'Master Data'!$G$2:$L$41,6,FALSE)),\"\",VLOOKUP($F10,'Master Data'!$G$2:$L$41,6,FALSE))","v":"-"},"0700222987012","BANK MANDIRI","KELUARGA 1 - PESERTA 2"]
[7,"KELUARGA 4 - PESERTA 2","F","E","1985-06-12","026-IP400-OP100-M12000",{"$f":"IF(ISNA(VLOOKUP($F11,'Master Data'!$G$2:$L$41,2,FALSE)),\"\",VLOOKUP($F11,'Master Data'!$G$2:$L$41,2,FALSE))","v":"IP400"},{"$f":"IF(ISNA(VLOOKUP($F11,'Master Data'!$G$2:$L$41,3,FALSE)),\"\",VLOOKUP($F11,'Master Data'!$G$2:$L$41,3,FALSE))","v":"OP100"},{"$f":"IF(ISNA(VLOOKUP($F11,'Master Data'!$G$2:$L$41,4,FALSE)),\"\",VLOOKUP($F11,'Master Data'!$G$2:$L$41,4,FALSE))","v":"-"},{"$f":"IF(ISNA(VLOOKUP($F11,'Master Data'!$G$2:$L$41,5,FALSE)),\"\",VLOOKUP($F11,'Master Data'!$G$2:$L$41,5,FALSE))","v":"M12000"},{"$f":"IF(ISNA(VLOOKUP($F11,'Master Data'!$G$2:$L$41,6,FALSE)),\"\",VLOOKUP($F11,'Master Data'!$G$2:$L$41,6,FALSE))","v":"-"},"0600888555647","BANK MANDIRI","KELUARGA 2 - PESERTA 2"]
[8,"KELUARGA 5 - PESERTA 1","F","E","1991-06-13","031-IP400-D4000-M12000",{"$f":"IF(ISNA(VLOOKUP($F12,'Master Data'!$G$2:$L$41,2,FALSE)),\"\",VLOOKUP($F12,'Master Data'!$G$2:$L$41,2,FALSE))","v":"IP400"},{"$f":"IF(ISNA(VLOOKUP($F12,'Master Data'!$G$2:$L$41,3,FALSE)),\"\",VLOOKUP($F12,'Master Data'!$G$2:$L$41,3,FALSE))","v":"-"},{"$f":"IF(ISNA(VLOOKUP($F12,'Master Data'!$G$2:$L$41,4,FALSE)),\"\",VLOOKUP($F12,'Master Data'!$G$2:$L$41,4,FALSE))","v":"D4000"},{"$f":"IF(ISNA(VLOOKUP($F12,'Master Data'!$G$2:$L$41,5,FALSE)),\"\",VLOOKUP($F12,'Master Data'!$G$2:$L$41,5,FALSE))","v":"M12000"},{"$f":"IF(ISNA(VLOOKUP($F12,'Master Data'!$G$2:$L$41,6,FALSE)),\"\",VLOOKUP($F12,'Master Data'!$G$2:$L$41,6,FALSE))","v":"-"},"0700765888112","BANK CENTRAL ASIA","KELUARGA 3 - PESERTA 1"]
[9,"KELUARGA 6 - PESERTA 1","M","E","1990-06-14","012-IP500-D5000",{"$f":"IF(ISNA(VLOOKUP($F13,'Master Data'!$G$2:$L$41,2,FALSE)),\"\",VLOOKUP($F13,'Master Data'!$G$2:$L$41,2,FALSE))","v":"IP500"},{"$f":"IF(ISNA(VLOOKUP($F13,'Master Data'!$G$2:$L$41,3,FALSE)),\"\",VLOOKUP($F13,'Master Data'!$G$2:$L$41,3,FALSE))","v":"-"},{"$f":"IF(ISNA(VLOOKUP($F13,'Master Data'!$G$2:$L$41,4,FALSE)),\"\",VLOOKUP($F13,'Master Data'!$G$2:$L$41,4,FALSE))","v":"D5000"},{"$f":"IF(ISNA(VLOOKUP($F13,'Master Data'!$G$2:$L$41,5,FALSE)),\"\",VLOOKUP($F13,'Master Data'!$G$2:$L$41,5,FALSE))","v":"-"},{"$f":"IF(ISNA(VLOOKUP($F13,'Master Data'!$G$2:$L$41,6,FALSE)),\"\",VLOOKUP($F13,'Master Data'!$G$2:$L$41,6,FALSE))","v":"-"},"0700765888112","BANK CENTRAL ASIA","KELUARGA 3 - PESERTA 1"]
[10,"KELUARGA 6 - PESERTA 2","M","C","2000-06-15","002-IP500",{"$f":"IF(ISNA(VLOOKUP($F14,'Master Data'!$G$2:$L$41,2,FALSE)),\"\",VLOOKUP($F14,'Master Data'!$G$2:$L$41,2,FALSE))","v":"IP500"},{"$f":"IF(ISNA(VLOOKUP($F14,'Master Data'!$G$2:$L$41,3,FALSE)),\"\",VLOOKUP($F14,'Master Data'!$G$2:$L$41,3,FALSE))","v":"-"},{"$f":"IF(ISNA(VLOOKUP($F14,'Master Data'!$G$2:$L$41,4,FALSE)),\"\",VLOOKUP($F14,'Master Data'!$G$2:$L$41,4,FALSE))","v":"-"},{"$f":"IF(ISNA(VLOOKUP($F14,'Master Data'!$G$2:$L$41,5,FALSE)),\"\",VLOOKUP($F14,'Master Data'!$G$2:$L$41,5,FALSE))","v":"-"},{"$f":"IF(ISNA(VLOOKUP($F14,'Master Data'!$G$2:$L$41,6,FALSE)),\"\",VLOOKUP($F14,'Master Data'!$G$2:$L$41,6,FALSE))","v":"-"},"0700765888112","BANK CENTRAL ASIA","KELUARGA 3 - PESERTA 1"]
[11,"KELUARGA 7 - PESERTA 1","F","E","1990-06-14","036-IP400-OP100-D4000-M12000",{"$f":"IF(ISNA(VLOOKUP($F15,'Master Data'!$G$2:$L$41,2,FALSE)),\"\",VLOOKUP($F15,'Master Data'!$G$2:$L$41,2,FALSE))","v":"IP400"},{"$f":"IF(ISNA(VLOOKUP($F15,'Master Data'!$G$2:$L$41,3,FALSE)),\"\",VLOOKUP($F15,'Master Data'!$G$2:$L$41,3,FALSE))","v":"OP100"},{"$f":"IF(ISNA(VLOOKUP($F15,'Master Data'!$G$2:$L$41,4,FALSE)),\"\",VLOOKUP($F15,'Master Data'!$G$2:$L$41,4,FALSE))","v":"D4000"},{"$f":"IF(ISNA(VLOOKUP($F15,'Master Data'!$G$2:$L$41,5,FALSE)),\"\",VLOOKUP($F15,'Master Data'!$G$2:$L$41,5,FALSE))","v":"M12000"},{"$f":"IF(ISNA(VLOOKUP($F15,'Master Data'!$G$2:$L$41,6,FALSE)),\"\",VLOOKUP($F15,'Master Data'!$G$2:$L$41,6,FALSE))","v":"-"},"0700222987012","BANK MANDIRI","KELUARGA 1 - PESERTA 3"]
[12,"KELUARGA 8 - PESERTA 1","F","E","1990-06-15","022-IP500-M14000",{"$f":"IF(ISNA(VLOOKUP($F16,'Master Data'!$G$2:$L$41,2,FALSE)),\"\",VLOOKUP($F16,'Master Data'!$G$2:$L$41,2,FALSE))","v":"IP500"},{"$f":"IF(ISNA(VLOOKUP($F16,'Master Data'!$G$2:$L$41,3,FALSE)),\"\",VLOOKUP($F16,'Master Data'!$G$2:$L$41,3,FALSE))","v":"-"},{"$f":"IF(ISNA(VLOOKUP($F16,'Master Data'!$G$2:$L$41,4,FALSE)),\"\",VLOOKUP($F16,'Master Data'!$G$2:$L$41,4,FALSE))","v":"-"},{"$f":"IF(ISNA(VLOOKUP($F16,'Master Data'!$G$2:$L$41,5,FALSE)),\"\",VLOOKUP($F16,'Master Data'!$G$2:$L$41,5,FALSE))","v":"M14000"},{"$f":"IF(ISNA(VLOOKUP($F16,'Master Data'!$G$2:$L$41,6,FALSE)),\"\",VLOOKUP($F16,'Master Data'!$G$2:$L$41,6,FALSE))","v":"-"},"0600888555647","BANK MANDIRI","KELUARGA 2 - PESERTA 3"]
[13,"KELUARGA 9 - PESERTA 1","M","E","1990-06-16","003-IP750",{"$f":"IF(ISNA(VLOOKUP($F17,'Master Data'!$G$2:$L$41,2,FALSE)),\"\",VLOOKUP($F17,'Master Data'!$G$2:$L$41,2,FALSE))","v":"IP750"},{"$f":"IF(ISNA(VLOOKUP($F17,'Master Data'!$G$2:$L$41,3,FALSE)),\"\",VLOOKUP($F17,'Master Data'!$G$2:$L$41,3,FALSE))","v":"-"},{"$f":"IF(ISNA(VLOOKUP($F17,'Master Data'!$G$2:$L$41,4,FALSE)),\"\",VLOOKUP($F17,'Master Data'!$G$2:$L$41,4,FALSE))","v":"-"},{"$f":"IF(ISNA(VLOOKUP($F17,'Master Data'!$G$2:$L$41,5,FALSE)),\"\",VLOOKUP($F17,'Master Data'!$G$2:$L$41,5,FALSE))","v":"-"},{"$f":"IF(ISNA(VLOOKUP($F17,'Master Data'!$G$2:$L$41,6,FALSE)),\"\",VLOOKUP($F17,'Master Data'!$G$2:$L$41,6,FALSE))","v":"-"},"0700765888112","BANK CENTRAL ASIA","KELUARGA 3 - PESERTA 1"]
[14,"KELUARGA 9 - PESERTA 2","F","E","1990-06-17","023-IP750-M16000",{"$f":"IF(ISNA(VLOOKUP($F18,'Master Data'!$G$2:$L$41,2,FALSE)),\"\",VLOOKUP($F18,'Master Data'!$G$2:$L$41,2,FALSE))","v":"IP750"},{"$f":"IF(ISNA(VLOOKUP($F18,'Master Data'!$G$2:$L$41,3,FALSE)),\"\",VLOOKUP($F18,'Master Data'!$G$2:$L$41,3,FALSE))","v":"-"},{"$f":"IF(ISNA(VLOOKUP($F18,'Master Data'!$G$2:$L$41,4,FALSE)),\"\",VLOOKUP($F18,'Master Data'!$G$2:$L$41,4,FALSE))","v":"-"},{"$f":"IF(ISNA(VLOOKUP($F18,'Master Data'!$G$2:$L$41,5,FALSE)),\"\",VLOOKUP($F18,'Master Data'!$G$2:$L$41,5,FALSE))","v":"M16000"},{"$f":"IF(ISNA(VLOOKUP($F18,'Master Data'!$G$2:$L$41,6,FALSE)),\"\",VLOOKUP($F18,'Master Data'!$G$2:$L$41,6,FALSE))","v":"-"},"0700765888112","BANK CENTRAL ASIA","KELUARGA 3 - PESERTA 1"]
[15,"KELUARGA 10 - PESERTA 1","F","E","1990-06-18","040-IP1200-OP225-D9000-M19000",{"$f":"IF(ISNA(VLOOKUP($F19,'Master Data'!$G$2:$L$41,2,FALSE)),\"\",VLOOKUP($F19,'Master Data'!$G$2:$L$41,2,FALSE))","v":"IP1200"},{"$f":"IF(ISNA(VLOOKUP($F19,'Master Data'!$G$2:$L$41,3,FALSE)),\"\",VLOOKUP($F19,'Master Data'!$G$2:$L$41,3,FALSE))","v":"OP225"},{"$f":"IF(ISNA(VLOOKUP($F19,'Master Data'!$G$2:$L$41,4,FALSE)),\"\",VLOOKUP($F19,'Master Data'!$G$2:$L$41,4,FALSE))","v":"D9000"},{"$f":"IF(ISNA(VLOOKUP($F19,'Master Data'!$G$2:$L$41,5,FALSE)),\"\",VLOOKUP($F19,'Master Data'!$G$2:$L$41,5,FALSE))","v":"M19000"},{"$f":"IF(ISNA(VLOOKUP($F19,'Master Data'!$G$2:$L$41,6,FALSE)),\"\",VLOOKUP($F19,'Master Data'!$G$2:$L$41,6,FALSE))","v":"-"},"0700765888112","BANK CENTRAL ASIA","KELUARGA 3 - PESERTA 1"]
[16,null,null,null,null,null,{"$f":"IF(ISNA(VLOOKUP($F20,'Master Data'!$G$2:$L$41,2,FALSE)),\"\",VLOOKUP($F20,'Master Data'!$G$2:$L$41,2,FALSE))","v":""},{"$f":"IF(ISNA(VLOOKUP($F20,'Master Data'!$G$2:$L$41,3,FALSE)),\"\",VLOOKUP($F20,'Master Data'!$G$2:$L$41,3,FALSE))","v":""},{"$f":"IF(ISNA(VLOOKUP($F20,'Master Data'!$G$2:$L$41,4,FALSE)),\"\",VLOOKUP($F20,'Master Data'!$G$2:$L$41,4,FALSE))","v":""},{"$f":"IF(ISNA(VLOOKUP($F20,'Master Data'!$G$2:$L$41,5,FALSE)),\"\",VLOOKUP($F20,'Master Data'!$G$2:$L$41,5,FALSE))","v":""},{"$f":"IF(ISNA(VLOOKUP($F20,'Master Data'!$G$2:$L$41,6,FALSE)),\"\",VLOOKUP($F20,'Master Data'!$G$2:$L$41,6,FALSE))","v":""}]
{"$rows_left_out":85}
{"sheet":"Master Data","index":1,"n_rows":138,"n_cols":32,"rows_kept":138,"cut":false,"hidden":true,"merged":[]}
["Gender",null,"Minimum Age",null,"Occupation",null,"Plan","IP","OP","D","MA","O",null,null,"Plan","IP","OP","D","MA","O",null,"M","F",null,null,null,"BANKKEY","BANKDESC","FACTHOUS01","Status",null,"Political Exposed Persons (PEP)"]
["M",null,{"$f":"NOW()","v":"2022-10-25T09:49:36.790"},null,"E",null,"001-IP400","IP400","-","-","-","-",null,null,"001-IP400","IP400",null,null,null,null,null,"001-IP400","001-IP400",null,null,null,"ABN-BALI  ","ABN AMRO-BALI                 ","30",{"$f":"IF(AB2=AB1,\"SAMA\",\"BEDA\")","v":"BEDA"},null,"Ya"]
["F",45,{"$f":"DATE(YEAR($C$2)-$B$3,MONTH($C$2),DAY($C$2))","v":"1977-10-25"},null,"S",null,"002-IP500","IP500","-","-","-","-",null,null,"002-IP500","IP500",null,null,null,null,null,"002-IP500","002-IP500",null,null,null,"0610306   ","ANZ INDONESIA                 ","AA",{"$f":"IF(AB3=AB2,\"SAMA\",\"BEDA\")","v":"BEDA"},null,"Tidak"]
[null,25,{"$f":"DATE(YEAR($C$2)-$B$4,MONTH($C$2),DAY($C$2))","v":"1997-10-25"},null,"C",null,"003-IP750","IP750","-","-","-","-",null,null,"003-IP750","IP750",null,null,null,null,null,"003-IP750","003-IP750",null,null,null,"0370028   ","ARTHA GRAHA INTERNASIONAL TBK ","AA","BEDA"]
[null,null,null,null,null,null,"004-IP1000","IP1000","-","-","-","-",null,null,"004-IP1000","IP1000",null,null,null,null,null,"004-IP1000","004-IP1000",null,null,null,"9450305   ","BANK AGRIS                    ","AA","BEDA"]
[null,null,null,null,null,null,"005-IP1200","IP1200","-","-","-","-",null,null,"005-IP1200","IP1200",null,null,null,null,null,"005-IP1200","005-IP1200",null,null,null,"4940014   ","BANK AGRONIAGA                ","AA","BEDA"]
[null,null,null,null,null,null,"006-IP400-OP100","IP400","OP100","-","-","-",null,null,"006-IP400-OP100","IP400","OP100",null,null,null,null,"006-IP400-OP100","006-IP400-OP100",null,null,null,"0880055   ","BANK ANTAR DAERAH             ","AA","BEDA"]
[null,null,null,null,null,null,"007-IP500-OP125","IP500","OP125","-","-","-",null,null,"007-IP500-OP125","IP500","OP125",null,null,null,null,"007-IP500-OP125","007-IP500-OP125",null,null,null,"4410010   ","BANK BUKOPIN                  ","AA","BEDA"]
[null,null,null,null,null,null,"008-IP750-OP150","IP750","OP150","-","-","-",null,null,"008-IP750-OP150","IP750","OP150",null,null,null,null,"008-IP750-OP150","008-IP750-OP150",null,null,null,"5210031   ","BANK BUKOPIN SYARIAH          ","AA","BEDA"]
[null,null,null,null,null,null,"009-IP1000-OP200","IP1000","OP200","-","-","-",null,null,"009-IP1000-OP200","IP1000","OP200",null,null,null,null,"009-IP1000-OP200","009-IP1000-OP200",null,null,null,"0760010   ","BANK BUMI ARTA                ","AA","BEDA"]
[null,null,null,null,null,null,"010-IP1200-OP225","IP1200","OP225","-","-","-",null,null,"010-IP1200-OP225","IP1200","OP225",null,null,null,null,"010-IP1200-OP225","010-IP1200-OP225",null,null,null,"0540308   ","BANK CAPITAL INDONESIA        ","AA","BEDA"]
[null,null,null,null,null,null,"011-IP400-D4000","IP400","-","D4000","-","-",null,null,"011-IP400-D4000","IP400",null,"D4000",null,null,null,"011-IP400-D4000","011-IP400-D4000",null,null,null,"0140397   ","BANK CENTRAL ASIA             ","AA","BEDA"]
[null,null,null,null,null,null,"012-IP500-D5000","IP500","-","D5000","-","-",null,null,"012-IP500-D5000","IP500",null,"D5000",null,null,null,"012-IP500-D5000","012-IP500-D5000",null,null,null,"5360017   ","BANK CENTRAL ASIA SYARIAH     ","AA","BEDA"]
[null,null,null,null,null,null,"013-IP750-D6000","IP750","-","D6000","-","-",null,null,"013-IP750-D6000","IP750",null,"D6000",null,null,null,"013-IP750-D6000","013-IP750-D6000",null,null,null,"0229920   ","BANK CIMB NIAGA SYARIAH       ","AA","BEDA"]
[null,null,null,null,null,null,"014-IP1000-D8000","IP1000","-","D8000","-","-",null,null,"014-IP1000-D8000","IP1000",null,"D8000",null,null,null,"014-IP1000-D8000","014-IP1000-D8000",null,null,null,"0220026   ","BANK CIMB NIAGA TBK           ","AA","BEDA"]
[null,null,null,null,null,null,"015-IP1200-D9000","IP1200","-","D9000","-","-",null,null,"015-IP1200-D9000","IP1200",null,"D9000",null,null,null,"015-IP1200-D9000","015-IP1200-D9000",null,null,null,"0110042   ","BANK DANAMON INDONESIA        ","AA","BEDA"]
[null,null,null,null,null,null,"016-IP400-OP100-D4000","IP400","OP100","D4000","-","-",null,null,"016-IP400-OP100-D4000","IP400","OP100","D4000",null,null,null,"016-IP400-OP100-D4000","016-IP400-OP100-D4000",null,null,null,"0119920   ","BANK DANAMON INDONESIA SYARIAH","AA","BEDA"]
[null,null,null,null,null,null,"017-IP500-OP125-D5000","IP500","OP125","D5000","-","-",null,null,"017-IP500-OP125-D5000","IP500","OP125","D5000",null,null,null,"017-IP500-OP125-D5000","017-IP500-OP125-D5000",null,null,null,"5620029   ","BANK FAMA INTERNATIONAL       ","AA","BEDA"]
[null,null,null,null,null,null,"018-IP750-OP150-D6000","IP750","OP150","D6000","-","-",null,null,"018-IP750-OP150-D6000","IP750","OP150","D6000",null,null,null,"018-IP750-OP150-D6000","018-IP750-OP150-D6000",null,null,null,"1610017   ","BANK GANESHA                  ","AA","BEDA"]
[null,null,null,null,null,null,"019-IP1000-OP200-D8000","IP1000","OP200","D8000","-","-",null,null,"019-IP1000-OP200-D8000","IP1000","OP200","D8000",null,null,null,"019-IP1000-OP200-D8000","019-IP1000-OP200-D8000",null,null,null,"4840017   ","BANK HANA                     ","AA","BEDA"]
{"$rows_left_out":118}